2-(Diethylamino)-pentanenitrile

Gas phase thermochemistry data

Data compiled as indicated in comments:
ALS - Hussein Y. Afeefy, Joel F. Liebman, and Stephen E. Stein
DRB - Donald R. Burgess, Jr.

Quantity Value Units Method Reference Comment
Δfgas-4.5 ± 1.0kJ/molCcbWelle, Verevkin, et al., 1997ALS
Δfgas-4.5kJ/molN/ALebedeva and Gutner, 1972Value computed using ΔfHliquid° value of -61.9±0.8 kj/mol from Lebedeva and Gutner, 1972 and ΔvapH° value of 57.4 kj/mol from Welle, Verevkin, et al., 1997.; DRB

Phase change data

Data compiled as indicated in comments:
ALS - Hussein Y. Afeefy, Joel F. Liebman, and Stephen E. Stein
DRB - Donald R. Burgess, Jr.
AC - William E. Acree, Jr., James S. Chickos

Quantity Value Units Method Reference Comment
Δvap13.72 ± 0.091kcal/molVWelle, Verevkin, et al., 1997ALS
Δvap13.7kcal/molN/AWelle, Verevkin, et al., 1997DRB
Δvap14.1kcal/molAStephenson and Malanowski, 1987Based on data from 283. - 326. K.; AC

Enthalpy of vaporization

ΔvapH (kcal/mol) Temperature (K) Method Reference Comment
13.7 ± 0.1283. - 318.GSWelle, Verevkin, et al., 1997AC

Condensed phase thermochemistry data

Data compiled by: Hussein Y. Afeefy, Joel F. Liebman, and Stephen E. Stein

Quantity Value Units Method Reference Comment
Δfliquid-14.8kcal/molCcbWelle, Verevkin, et al., 1997
Δfliquid-14.8 ± 0.2kcal/molCcbLebedeva and Gutner, 1972
Quantity Value Units Method Reference Comment
Δcliquid-1446.5 ± 0.2kcal/molCcbLebedeva and Gutner, 1972

References

Welle, Verevkin, et al., 1997
Welle, F.M.; Verevkin, S.P.; Beckhaus, H.-D.; Ruchardt, C., Stabilization of the cyano(dimethylamino)methyl radical - synergistic effect due to interaction between α-cyano groups on the radical stabilization energy, Liebigs Ann., 1997, 155-163. [all data]

Lebedeva and Gutner, 1972
Lebedeva, N.D.; Gutner, N.M., Heats of combustion and formation of certain aliphatic amino-derivatives, Russ. J. Phys. Chem. (Engl. Transl.), 1972, 46, 622. [all data]