Dibenzo[m,pqr]naptho[1,2,3,4-tuv]picene

Gas phase ion energetics data

Data compiled by: Sharon G. Lias, Rhoda D. Levin, and Sherif A. Kafafi

Ionization energy determinations

IE (eV) Method Reference Comment
6.59 ± 0.02PEClar and Schmidt, 1978Vertical value

Phase change data

Data compiled by: William E. Acree, Jr., James S. Chickos

Enthalpy of sublimation

ΔsubH (kJ/mol) Temperature (K) Method Reference Comment
154.1493.AStephenson and Malanowski, 1987Based on data from 478. - 603. K.

References

Clar and Schmidt, 1978
Clar, E.; Schmidt, W., Correlations between photoelectron and ultravioet absorption spectra of polycyclic hydrocarbons. The terrylene and peropyrene series, Tetrahedron, 1978, 34, 3219. [all data]