Thallium (I) n-decanoate

Phase change data

Data compiled by: Eugene S. Domalski and Elizabeth D. Hearing

Enthalpy of phase transition

ΔHtrs (kJ/mol) Temperature (K) Initial Phase Final Phase Reference Comment
2.411232.4crystaline, Vcrystaline, IVLopez de la Fuente, Cheda, et al., 1988
0.599288.6crystaline, IVcrystaline, IIILopez de la Fuente, Cheda, et al., 1988
4.240306.8crystaline, IIIcrystaline, IILopez de la Fuente, Cheda, et al., 1988
3.974405.0crystaline, IIcrystaline, ILopez de la Fuente, Cheda, et al., 1988
5.670405.0crystaline, IliquidLopez de la Fuente, Cheda, et al., 1988
2.552484.0liquidliquidLopez de la Fuente, Cheda, et al., 1988
1.829283.0crystaline, VIcrystaline, VLopez de la Fuente and Westrum, 1987
2.087285.2crystaline, Vcrystaline, IVLopez de la Fuente and Westrum, 1987
1.413293.6crystaline, IVcrystaline, IIILopez de la Fuente and Westrum, 1987
4.490312.3crystaline, IIIcrystaline, IILopez de la Fuente and Westrum, 1987S= 14.38 J/mol*K.
2.054356.6crystaline, IIcrystaline, ILopez de la Fuente and Westrum, 1987
5.454400.1crystaline, IliquidLopez de la Fuente and Westrum, 1987S= 13.64 J/mol*K Solid-mesophase.
1.971471.6liquidliquidLopez de la Fuente and Westrum, 1987
3.807312.crystaline, IIIcrystaline, IIMeisel, Seybold, et al., 1976
2.427354.crystaline, IIcrystaline, IMeisel, Seybold, et al., 1976
1.925471.liquidliquidMeisel, Seybold, et al., 1976
5.858398.crystaline, IliquidMeisel, Seybold, et al., 1976

Entropy of phase transition

ΔStrs (J/mol*K) Temperature (K) Initial Phase Final Phase Reference Comment
10.39232.4crystaline, Vcrystaline, IVLopez de la Fuente, Cheda, et al., 1988
2.08288.6crystaline, IVcrystaline, IIILopez de la Fuente, Cheda, et al., 1988
13.89306.8crystaline, IIIcrystaline, IILopez de la Fuente, Cheda, et al., 1988
13.97405.0crystaline, I, Solidliquid, mesophaseLopez de la Fuente, Cheda, et al., 1988
5.24484.0liquid, Mesophaseliquid, isotropic liquidLopez de la Fuente, Cheda, et al., 1988
6.49283.0crystaline, VIcrystaline, VLopez de la Fuente and Westrum, 1987
7.32285.2crystaline, Vcrystaline, IVLopez de la Fuente and Westrum, 1987
4.82293.6crystaline, IVcrystaline, IIILopez de la Fuente and Westrum, 1987
5.74356.6crystaline, IIcrystaline, ILopez de la Fuente and Westrum, 1987
4.16471.6liquid, Mesophaseliquid, isotropic liquidLopez de la Fuente and Westrum, 1987
12.1312.crystaline, IIIcrystaline, IIMeisel, Seybold, et al., 1976
6.69354.crystaline, IIcrystaline, IMeisel, Seybold, et al., 1976
4.10471.liquid, Mesophaseliquid, isotropicMeisel, Seybold, et al., 1976
14.2398.crystaline, I, Solidliquid, mesophaseMeisel, Seybold, et al., 1976

References

Lopez de la Fuente, Cheda, et al., 1988
Lopez de la Fuente, F.L.; Cheda, J.A.R.; Fernandez-Martin, F.; Westrum, E.F., Jr., Thermodynamics of thallium alkanoates. V. Heat capacity and thermodynamic functions of thallium(I) n-decanoate from 6 to 480 K, J. Chem. Thermodynam., 1988, 20, 1137-1148. [all data]

Lopez de la Fuente and Westrum, 1987
Lopez de la Fuente, F.L.; Westrum, E.F., Jr., Cheda, J.A.R., and Fernandez-Martin, F., Thermophysics of thallium alkanoates. IV. Heat capacity and thermodynamic functions of thallium(I) n-dodecanoate from 7 to 470 K, J. Chem. Thermodynam., 1987, 19, 1261-1270. [all data]

Meisel, Seybold, et al., 1976
Meisel, T.; Seybold, K.; Halmos, Z.; Roth, J.; Melykuti, C., Thermal behavior of thallium(I) fatty acid salts. I, J. Therm. Anal., 1976, 10, 419-431. [all data]