Propane, 1,2,3-trichloro-2-(chloromethyl)-

Kovats' RI, non-polar column, isothermal

View large format table.

Column type Active phase Temperature (C) I Reference Comment
PackedSqualane110.1105.Engewald, Mai, et al., 1976N2, Chromosorb W (60-80 mesh); Column length: 3. m

References

Engewald, Mai, et al., 1976
Engewald, V.W.; Mai, H.; Mühlstädt, M., Gaschromatographische Charakterisierung von Chlorierungs-produkten des Isobutens, J. Prakt. Chem., 1976, 318, 4, 565-574, https://doi.org/10.1002/prac.19763180405 . [all data]