[2,3-d]-Furocycloheptatrienone

Gas phase ion energetics data

Data compiled as indicated in comments:
LBLHLM - Sharon G. Lias, John E. Bartmess, Joel F. Liebman, John L. Holmes, Rhoda D. Levin, and W. Gary Mallard

Ionization energy determinations

IE (eV) Method Reference Comment
8.65PEGleiter, Bischof, et al., 1984LBLHLM

References

Gleiter, Bischof, et al., 1984
Gleiter, R.; Bischof, P.; Bohm, M.C.; Guilard, R.; Yamaguchi, H., The electronic structure of heterotropones. Photoelectron spectra and molecular orbital calculations, Bull. Chem. Soc. Jpn., 1984, 57, 856. [all data]