4,4'-Dianilino-3,3'-diaminodiphenyl oxide

Condensed phase thermochemistry data

Data compiled by: Eugene S. Domalski and Elizabeth D. Hearing

Quantity Value Units Method Reference Comment
solid,1 bar431.8J/mol*KN/AKaryakin, Sapozhnikov, et al., 1973

Constant pressure heat capacity of solid

Cp,solid (J/mol*K) Temperature (K) Reference Comment
458.1300.Karyakin, Sapozhnikov, et al., 1973T = 20 to 300 K.

References

Karyakin, Sapozhnikov, et al., 1973
Karyakin, N.V.; Sapozhnikov, V.N.; Mochilov, A.N.; Aron, B.M.; Chernova, V.I.; Rabinovich, I.B., Low temperature heat capacity and thermodynamic properties of some amines, Tr. Khim. Khim. Tekhnol., 1973, (1), 53-54. [all data]