N,N-Diethylthiobenzamide

Phase change data

Data compiled by: Hussein Y. Afeefy, Joel F. Liebman, and Stephen E. Stein

Quantity Value Units Method Reference Comment
Δsub91.4 ± 3.2kJ/molCRibeiro Da Silva, Souza, et al., 1989

References

Ribeiro Da Silva, Souza, et al., 1989
Ribeiro Da Silva, M.D.M.C.; Souza, P.; Pilcher, G., Enthalpies of combustion of thiobenzamide, N,N-dimethylthiobenzamide, and N,N-diethylthiobenzamide, J. Chem. Thermodyn., 1989, 21, 173-178. [all data]