1H-Pyrazole, 3,5-bis(1,1-dimethylethyl)-4-methyl-

Gas phase ion energetics data

Data evaluated by: Edward P. Hunter and Sharon G. Lias

Quantity Value Units Method Reference Comment
Proton affinity (review)967.5kJ/molN/AHunter and Lias, 1998
Quantity Value Units Method Reference Comment
Gas basicity933.8kJ/molN/AHunter and Lias, 1998

References

Hunter and Lias, 1998
Hunter, E.P.; Lias, S.G., Evaluated Gas Phase Basicities and Proton Affinities of Molecules: An Update, J. Phys. Chem. Ref. Data, 1998, 27, 3, 413-656, https://doi.org/10.1063/1.556018 . [all data]