Pyridine, 2,3,4,5-tetramethyl-

Kovats' RI, non-polar column, isothermal

View large format table.

Column type Active phase Temperature (C) I Reference Comment
CapillaryOV-101110.1220.Zhuravleva, Terenina, et al., 199040. m/0.27 mm/0.4 μm

Kovats' RI, polar column, isothermal

View large format table.

Column type Active phase Temperature (C) I Reference Comment
CapillaryPEG-40M110.1696.Zhuravleva, Terenina, et al., 199040. m/0.22 mm/0.40 μm

References

Zhuravleva, Terenina, et al., 1990
Zhuravleva, I.L.; Terenina, M.B.; Shenderyuk, V.V.; Golovnya, R.V., Capillary chromatography. Calculation of retention indices of alkylpyridines on the basis of non-equal energy contributions of identical alkyl groups, Zh. Anal. Khim., 1990, 45, 722-729. [all data]