Naphthalene, 1,4-dichloro-

Normal alkane RI, non-polar column, custom temperature program

View large format table.

Column type Active phase I Reference Comment
CapillaryUltra-21620.Nakano, Fujimori, et al., 199225. m/0.20 mm/0.33 μm; Program: 50 0C (2 min) 30 0C/min -> 200 0C 8 0C/min -> 280 0C (10 min)

Phase change data

Data compiled by: William E. Acree, Jr., James S. Chickos

Enthalpy of vaporization

ΔvapH (kcal/mol) Temperature (K) Method Reference Comment
14.0373.GCLei, Wania, et al., 1999Based on data from 323. - 423. K.

References

Nakano, Fujimori, et al., 1992
Nakano, T.; Fujimori, K.; Takaishi, Y.; Okuno, T., GC/MS-SIM analysis of polychlorobenzenes, polychlorophenols and polychloronaphthalenes, Report of the Environmental Science Institute of Hyogo Prefecture, 1992, 24, 30-37. [all data]