Benzenamine, 2-propyl-

Kovats' RI, polar column, isothermal

View large format table.

Column type Active phase Temperature (C) I Reference Comment
PackedCarbowax 20M200.1975.Vernon and Suratman, 1983He, Silanized white support; Column length: 2. m

References

Vernon and Suratman, 1983
Vernon, F.; Suratman, J.B., The retention index system applied to alkylbenzenes and monosubstituted derivatives, Chromatographia, 1983, 17, 11, 600-604, https://doi.org/10.1007/BF02261943 . [all data]