Silacyclopent-2-ene,1,1-dimethyl-

Gas phase ion energetics data

Data compiled by: Sharon G. Lias, Rhoda D. Levin, and Sherif A. Kafafi

Ionization energy determinations

IE (eV) Method Reference Comment
9.27 ± 0.03PEGuimon, Pfister-Guillouzo, et al., 1978Vertical value

References

Guimon, Pfister-Guillouzo, et al., 1978
Guimon, C.; Pfister-Guillouzo, G.; Manuel, G.; Mazerolles, P., Structure electronique de silacyclopentenes-2 et-3, J. Organomet. Chem., 1978, 149, 149. [all data]