4-Phenyl-3-butyn-2-one

Condensed phase thermochemistry data

Data compiled as indicated in comments:
DRB - Donald R. Burgess, Jr.
ALS - Hussein Y. Afeefy, Joel F. Liebman, and Stephen E. Stein

Quantity Value Units Method Reference Comment
Δfliquid94.7 ± 5.0kJ/molCcbN/Arecalculated with modern CO2,H2O thermo; estimated uncertainty (NOTE all values in source also have wrong sign); DRB
Δfliquid-63.6kJ/molCcbMoureu and Andre, 1914ALS
Quantity Value Units Method Reference Comment
Δcliquid-5173.1kJ/molCcbMoureu and Andre, 1914Corresponding Δfliquid = 94.6 kJ/mol (simple calculation by NIST; no Washburn corrections); ALS

Phase change data

Data compiled by: Robert L. Brown and Stephen E. Stein

Reduced pressure boiling point

Tboil (K) Pressure (atm) Reference
351. - 352.0.0003Farchan Laboratories, 1990
348.70.001Weast and Grasselli, 1989

References

Moureu and Andre, 1914
Moureu, C.; Andre, E., Thermochimie des composes acetyleniques, Ann. Chim. Phys., 1914, 1, 113-145. [all data]