3-Buten-2-one, 4-(4-iodophenyl)-

Gas phase ion energetics data

Data compiled as indicated in comments:
LLK - Sharon G. Lias, Rhoda D. Levin, and Sherif A. Kafafi

Ionization energy determinations

IE (eV) Method Reference Comment
8.4 ± 0.05EISchaldach, Grotemeyer, et al., 1981LLK

References

Schaldach, Grotemeyer, et al., 1981
Schaldach, B.; Grotemeyer, B.; Grotemeyer, J.; Grutzmacher, H.-F., Kinetic and thermodynamic effects on intramolecular aromatic substitution in meta and para substituted benzalacetones, Org. Mass Spectrom., 1981, 16, 410. [all data]