1,5,7,11-Tetrathiaspiro[5.5]undecane

Gas phase ion energetics data

Data compiled by: Sharon G. Lias, Rhoda D. Levin, and Sherif A. Kafafi

Ionization energy determinations

IE (eV) Method Reference Comment
8.09PEKobayashi, Gleiter, et al., 1977Vertical value

References

Kobayashi, Gleiter, et al., 1977
Kobayashi, M.; Gleiter, R.; Coffen, D.L.; Bock, H.; Schulz, W.; Stein, U., Spiroconjugation in orthothiocarbonates, Tetrahedron, 1977, 33, 433. [all data]