Phenanthrene, 2,9-dimethyl-

Normal alkane RI, non-polar column, temperature ramp

View large format table.

Column type Active phase I Reference Comment
CapillaryOV-12018.Asif and Fazeelat, 2006Nitrogen, 4. K/min; Column length: 30. m; Column diameter: 0.25 mm; Tstart: 60. C; Tend: 290. C

Lee's RI, non-polar column, temperature ramp

View large format table.

Column type Active phase I Reference Comment
CapillaryHP-5341.75Pedersen, Durant, et al., 200530. m/0.25 mm/0.25 μm, Helium, 50. C @ 1.5 min, 6. K/min, 310. C @ 10. min
CapillaryDB-5342.43Wang, Fingas, et al., 199430. m/0.32 mm/0.25 μm, He, 50. C @ 2. min, 6. K/min; Tend: 300. C
CapillaryCP Sil 8 CB342.3Bundt, Herbel, et al., 199150. m/0.25 mm/0.25 μm, He, 4. K/min; Tstart: 80. C; Tend: 300. C
CapillaryCP Sil 8 CB340.60Garrigues, Parlanti, et al., 198750. m/0.22 mm/0.13 μm, H2, 120. C @ 2. min, 3. K/min; Tend: 270. C

Lee's RI, non-polar column, custom temperature program

View large format table.

Column type Active phase I Reference Comment
CapillaryDB-5340.5Zamperlini, Silva, et al., 199730. m/0.25 mm/0.25 μm, He; Program: 90C (1min) => 10C/min => 120C => 4C/min => 310C (20min)
CapillaryCP Sil 8 CB341.4Bundt, Herbel, et al., 199150. m/0.25 mm/0.25 μm, He; Program: not specified
CapillaryCP Sil 8 CB342.2Bundt, Herbel, et al., 199150. m/0.25 mm/0.25 μm, He; Program: not specified

References

Asif and Fazeelat, 2006
Asif, M.; Fazeelat, T., Characterization of aromatic hydrocarbons in Dhurnal oil from Northen Indus Basin, J. Chem. Soc. Pakistan, 2006, 28, 2, 169-175. [all data]

Pedersen, Durant, et al., 2005
Pedersen, D.U.; Durant, J.L.; Taghizadeh, K.; Hemond, H.F.; Lafleur, A.L.; Cass, G.R., Human cell mutagenes in respirable airborne particles from the Northeastern United States. 2. Quantification of mutagenes and other organic compounds., Environ. Sci. Technol., 2005, 39, 24, 9547-9560, https://doi.org/10.1021/es050886c . [all data]

Wang, Fingas, et al., 1994
Wang, Z.; Fingas, M.; Li, K., Fractionation of a light crude oil and identification and quantitation of aliphatic, aromatic, and biomarker comopunds by GC-FID and GC-MS, Part II, J. Chromatogr. Sci., 1994, 32, 9, 367-382, https://doi.org/10.1093/chromsci/32.9.367 . [all data]

Bundt, Herbel, et al., 1991
Bundt, J.; Herbel, W.; Steinhart, H.; Franke, S.; Francke, W., Structure-type separation of diesel fuels by solid phase extraction and identification of the two- and three-ring aromatics by capillary GC-mass spectrometry, J. Hi. Res. Chromatogr., 1991, 14, 2, 91-98, https://doi.org/10.1002/jhrc.1240140205 . [all data]

Garrigues, Parlanti, et al., 1987
Garrigues, P.; Parlanti, E.; Radke, M.; Bellocq, J.; Willsch, H.; Ewald, M., Identification of alkylphenanthrenes in shale oil and coal by liquid and capillary gas chromatography and high-resolution spectrofluorimetry (Shpol'skii effect), J. Chromatogr., 1987, 395, 217-228, https://doi.org/10.1016/S0021-9673(01)94112-3 . [all data]

Zamperlini, Silva, et al., 1997
Zamperlini, G.C.M.; Silva, M.R.S.; Vilegas, W., Identification of polycyclic aromatic hydrocarbons in sugar cane soot by gas chromatography-mass spectrometry, Chromatographia, 1997, 46, 11/12, 655-663, https://doi.org/10.1007/BF02490527 . [all data]