Arsenotrithious acid, triphenyl ester

Gas phase ion energetics data

Data compiled by: Sharon G. Lias, Rhoda D. Levin, and Sherif A. Kafafi

Ionization energy determinations

IE (eV) Method Reference Comment
8.12 ± 0.05PEDistefano, Modelli, et al., 1981Vertical value

References

Distefano, Modelli, et al., 1981
Distefano, G.; Modelli, A.; Grassi, A.; Pappalardo, G.; Irgolic, K.; Pyles, R., Conformational properties of organyl(organylchalco-geno)arsines, RnAs(XR)3-n (X = S, Se, Te) II. Dipole moment and He(I) photoelectron spectroscopic studies of dimethyl(phenylthio)arsine and tris(phenyl-thio)arsine, J. Organomet. Chem., 1981, 220, 31. [all data]