Zirconium acetylacetonate

Gas phase ion energetics data

Data compiled as indicated in comments:
LBLHLM - Sharon G. Lias, John E. Bartmess, Joel F. Liebman, John L. Holmes, Rhoda D. Levin, and W. Gary Mallard
LLK - Sharon G. Lias, Rhoda D. Levin, and Sherif A. Kafafi

Ionization energy determinations

IE (eV) Method Reference Comment
7.6PECasarin, Ciliberto, et al., 1982LBLHLM
7.95PECasarin, Ciliberto, et al., 1982Vertical value; LBLHLM
7.95PEFragala, Condorelli, et al., 1978Vertical value; LLK

References

Casarin, Ciliberto, et al., 1982
Casarin, M.; Ciliberto, E.; Fragala, I.; Granozzi, G., Photoelectron spectroscopy of f-element coordination compounds. 2. He-II spectra of β-diketonate complexes of uranium(IV), thorium(IV), zirconium(IV) and dioxouranium(VI), Inorg. Chim. Acta, 1982, 64, 247. [all data]

Fragala, Condorelli, et al., 1978
Fragala, I.; Condorelli, G.; Tondello, A.; Cassol, A., Photoelectron spectroscopy of f-element coordination compounds. 1. β-diketonate complexes of uranium(IV), thorium(IV), zirconium(IV), dioxouranium(VI), Inorg. Chem., 1978, 17, 3175. [all data]