4-(3-Decyl)phenol

Reaction thermochemistry data

Data compiled by: Hussein Y. Afeefy, Joel F. Liebman, and Stephen E. Stein

Individual Reactions

4-(3-Decyl)phenol = 4-(1-methylnonyl)phenol

By formula: C16H26O = 4-(1-methylnonyl)phenol

Quantity Value Units Method Reference Comment
Δr-0.3 ± 0.1kJ/molEqkNesterova, Pimerzin, et al., 1989liquid phase; Isomerization

References

Nesterova, Pimerzin, et al., 1989
Nesterova, T.N.; Pimerzin, A.A.; Rozhnov, A.M.; Karlina, T.N., Equilibria for the isomerization of (secondary-alkyl)phenols and cyclohexylphenols, J. Chem. Thermodyn., 1989, 21, 385-395. [all data]