Naphthalene, 1,2,3,4,6,7-hexamethyl

Kovats' RI, non-polar column, isothermal

View large format table.

Column type Active phase Temperature (C) I Reference Comment
CapillaryApiezon L200.1986.Klemm, Shabtai, et al., 1981

References

Klemm, Shabtai, et al., 1981
Klemm, L.H.; Shabtai, J.; Bodily, K.C., Gas chromatography of some C13-C16 alkylnaphthalenes on Bentone 34, silicone fluid DC 550 and Apiezon L phases, J. Chromatogr., 1981, 206, 2, 372-375, https://doi.org/10.1016/S0021-9673(00)82549-2 . [all data]