MeS anion

Ion clustering data

Data compiled as indicated in comments:
B - John E. Bartmess
M - Michael M. Meot-Ner (Mautner) and Sharon G. Lias

Clustering reactions

(MeS anion • 4294967295Thioformaldehyde) + Thioformaldehyde = MeS anion

By formula: (CH3S- • 4294967295CH2S) + CH2S = CH3S-

Quantity Value Units Method Reference Comment
Δr305. ± 16.kJ/molN/ABartmess, Scott, et al., 1979gas phase; value altered from reference due to change in acidity scale; B

MeS anion + Isopropyl Alcohol = (MeS anion • Isopropyl Alcohol)

By formula: CH3S- + C3H8O = (CH3S- • C3H8O)

Quantity Value Units Method Reference Comment
Δr71.55 ± 0.84kJ/molTDAsSieck and Meot-ner, 1989gas phase; B,M
Quantity Value Units Method Reference Comment
Δr96.7J/mol*KPHPMSSieck and Meot-ner, 1989gas phase; M
Quantity Value Units Method Reference Comment
Δr42.7 ± 3.3kJ/molTDAsSieck and Meot-ner, 1989gas phase; B

MeS anion + Water = (MeS anion • Water)

By formula: CH3S- + H2O = (CH3S- • H2O)

Quantity Value Units Method Reference Comment
Δr62.76 ± 0.84kJ/molTDAsSieck and Meot-ner, 1989gas phase; B,M
Quantity Value Units Method Reference Comment
Δr88.7J/mol*KPHPMSSieck and Meot-ner, 1989gas phase; M
Quantity Value Units Method Reference Comment
Δr36.4 ± 2.9kJ/molTDAsSieck and Meot-ner, 1989gas phase; B

(MeS anion • Water) + Water = (MeS anion • 2Water)

By formula: (CH3S- • H2O) + H2O = (CH3S- • 2H2O)

Quantity Value Units Method Reference Comment
Δr56.5kJ/molPHPMSSieck and Meot-ner, 1989gas phase; M
Quantity Value Units Method Reference Comment
Δr98.3J/mol*KPHPMSSieck and Meot-ner, 1989gas phase; M

(MeS anion • 2Water) + Water = (MeS anion • 3Water)

By formula: (CH3S- • 2H2O) + H2O = (CH3S- • 3H2O)

Quantity Value Units Method Reference Comment
Δr46.4kJ/molPHPMSSieck and Meot-ner, 1989gas phase; M
Quantity Value Units Method Reference Comment
Δr85.8J/mol*KPHPMSSieck and Meot-ner, 1989gas phase; M

(MeS anion • 3Water) + Water = (MeS anion • 4Water)

By formula: (CH3S- • 3H2O) + H2O = (CH3S- • 4H2O)

Quantity Value Units Method Reference Comment
Δr40.kJ/molPHPMSSieck and Meot-ner, 1989gas phase; M
Quantity Value Units Method Reference Comment
Δr80.3J/mol*KPHPMSSieck and Meot-ner, 1989gas phase; M

Vibrational and/or electronic energy levels

Data compiled by: Marilyn E. Jacox

State:   ?

 Energy
 (cm-1
 Med.   Transition   λmin
 (nm)
 λmax
 (nm)

Gas phase ion energetics data

Data compiled by: John E. Bartmess

Protonation reactions

MeS anion + Hydrogen cation = Methanethiol

By formula: CH3S- + H+ = CH4S

Quantity Value Units Method Reference Comment
Δr357.6 ± 2.0kcal/molD-EASchwartz, Davico, et al., 2000gas phase
Δr357.5 ± 2.0kcal/molD-EAMoran and Ellison, 1988gas phase
Δr356.9 ± 2.2kcal/molG+TSBartmess, Scott, et al., 1979gas phase; value altered from reference due to change in acidity scale
Quantity Value Units Method Reference Comment
Δr350.6 ± 2.0kcal/molIMREBartmess, Scott, et al., 1979gas phase; value altered from reference due to change in acidity scale

References

Bartmess, Scott, et al., 1979
Bartmess, J.E.; Scott, J.A.; McIver, R.T., Jr., The gas phase acidity scale from methanol to phenol, J. Am. Chem. Soc., 1979, 101, 6047. [all data]

Sieck and Meot-ner, 1989
Sieck, L.W.; Meot-ner, M., Ionic Hydrogen Bond and Ion Solvation. 8. RS-..HOR Bond Strengths. Correlation with Acidities., J. Phys. Chem., 1989, 93, 4, 1586, https://doi.org/10.1021/j100341a079 . [all data]