Undecane, 3,6-dimethyl-

Kovats' RI, non-polar column, isothermal

View large format table.

Column type Active phase Temperature (C) I Reference Comment
CapillaryDC-200100.1214.Schomburg and Henneberg, 1968He; Column length: 100. m; Column diameter: 0.25 mm
CapillaryDC-200100.1215.Schomburg and Henneberg, 1968He; Column length: 100. m; Column diameter: 0.25 mm

Kovats' RI, non-polar column, temperature ramp

View large format table.

Column type Active phase I Reference Comment
CapillaryDB-51210.Ramarathnam, Rubin, et al., 1993He, 30. C @ 2. min, 10. K/min, 280. C @ 3. min; Column length: 30. m; Column diameter: 0.13 mm

Kovats' RI, non-polar column, custom temperature program

View large format table.

Column type Active phase I Reference Comment
CapillaryDC-2001221.Schomburg and Henneberg, 1968He; Column length: 100. m; Column diameter: 0.25 mm; Program: not specified

References

Schomburg and Henneberg, 1968
Schomburg, G.; Henneberg, D., Analyse von i-Paraffingemischen aus ?methylene insertion?-bzw. ?methylene-d2 insertion?-Reaktionen mit einer Kombination Capillar-Gas-Chromatographie/Massenspectrometrie, Anal. Chem., 1968, 236, 1, 279-294, https://doi.org/10.1007/BF00503281 . [all data]

Ramarathnam, Rubin, et al., 1993
Ramarathnam, N.; Rubin, L.J.; Diosady, L.L., Studies on meat flavor. 4. Fractionation, characterization, and quantitation of volatiles from uncured and cured beef and chicken, J. Agric. Food Chem., 1993, 41, 6, 939-945, https://doi.org/10.1021/jf00030a020 . [all data]