Pyridine, 2-chloro-6-methoxy-

Reaction thermochemistry data

Data compiled by: Hussein Y. Afeefy, Joel F. Liebman, and Stephen E. Stein

Individual Reactions

Pyridine, 2-chloro-6-methoxy- = 2(1H)-Pyridinone, 6-chloro-1-methyl-

By formula: C6H6ClNO = C6H6ClNO

Quantity Value Units Method Reference Comment
Δr-17. ± 9.2kJ/molCisoBeak, Woods, et al., 1972liquid phase

Van Den Dool and Kratz RI, non-polar column, temperature ramp

View large format table.

Column type Active phase I Reference Comment
CapillaryOV-11025.2Gautzsch and Zinn, 19968. K/min; Tstart: 35. C; Tend: 300. C

References

Beak, Woods, et al., 1972
Beak, P.; Woods, T.S.; Mueller, D.S., Equilibrium studies. Substituent effects on methoxpyridine-1-methylpyridone equilibriums, Tetrahedron, 1972, 28, 5507-5524. [all data]