1,5-Cyclododecadiene, (E,E)-

Kovats' RI, non-polar column, isothermal

View large format table.

Column type Active phase Temperature (C) I Reference Comment
CapillaryMethyl Silicone160.1321.Boneva and Balbolov, 199350. m/0.25 mm/1.0 μm, N2
CapillaryMethyl Silicone170.1332.Boneva and Balbolov, 199350. m/0.25 mm/1.0 μm, N2
CapillaryMethyl Silicone180.1341.Boneva and Balbolov, 199350. m/0.25 mm/1.0 μm, N2

References

Boneva and Balbolov, 1993
Boneva, S.; Balbolov, E., Capillary gas chromatography of hydrogenation products of 1,5,9-cyclododecatriene stereoisomers, Chromatographia, 1993, 37, 5/6, 277-280, https://doi.org/10.1007/BF02278633 . [all data]