3-Hexanamine

Phase change data

Data compiled by: Thermodynamics Research Center, NIST Boulder Laboratories, Chris Muzny director

Quantity Value Units Method Reference Comment
Tboil388.65KN/AIffland and Yen, 1954Uncertainty assigned by TRC = 2. K

In addition to the Thermodynamics Research Center (TRC) data available from this site, much more physical and chemical property data is available from the following TRC products:

References

Iffland and Yen, 1954
Iffland, D.C.; Yen, T.-F., Preparation of Amines by Low Pressure Hydrogenation of Oximes, J. Am. Chem. Soc., 1954, 76, 4180. [all data]