1,1':3',1'':3'',1''':3''',1''''-Quinquephenyl

Gas phase ion energetics data

Data compiled by: Henry M. Rosenstock, Keith Draxl, Bruce W. Steiner, and John T. Herron

Ionization energy determinations

IE (eV) Method Reference
8.45 ± 0.05EIGallegos, 1967

References

Gallegos, 1967
Gallegos, E.J., Mass spectrometry of some polyphenyls, J. Phys. Chem., 1967, 71, 1647. [all data]