5-Dodecen-1-ol, acetate, (Z)-

Van Den Dool and Kratz RI, non-polar column, temperature ramp

View large format table.

Column type Active phase I Reference Comment
CapillaryDB-51592.Marques, McElfresh, et al., 200030. m/0.25 mm/0.25 μm, 100. C @ 1. min, 5. K/min, 275. C @ 3. min

Normal alkane RI, polar column, isothermal

View large format table.

Column type Active phase Temperature (C) I Reference Comment
CapillaryPEG160.1962.Guo, Yuan, et al., 1984Column length: 30. m; Column diameter: 0.36 mm
CapillaryFFAP210.1958.Guo, Yuan, et al., 1984Column length: 80. m; Column diameter: 0.30 mm

References

Marques, McElfresh, et al., 2000
Marques, F.A.; McElfresh, J.S.; Millar, J.G., Kováts retention indexes of monounsaturated C12, C14, and C16 alcohols, acetates and aldehydes commonly found in lepidopteran pheromone blends, J. Braz. Chem. Soc., 2000, 11, 6, 592-599, https://doi.org/10.1590/S0103-50532000000600007 . [all data]

Guo, Yuan, et al., 1984
Guo, G.; Yuan, M.; Lin, G., Study on the resolution of geometric isomers of insect sex pheromones with capillary column GC, You ji hua xue, 1984, 5, 349-354. [all data]