Diselenide, diphenyl

Condensed phase thermochemistry data

Data compiled by: Hussein Y. Afeefy, Joel F. Liebman, and Stephen E. Stein

Quantity Value Units Method Reference Comment
Δfsolid120.6 ± 8.2kJ/molCcrMortimer and Waterhouse, 1980
Quantity Value Units Method Reference Comment
Δcsolid-6715.3 ± 2.8kJ/molCcrMortimer and Waterhouse, 1980

References

Mortimer and Waterhouse, 1980
Mortimer, C.T.; Waterhouse, J., Enthalpy of combustion of diphenyl diselenide, J. Chem. Thermodyn., 1980, 12, 961-965. [all data]