cis-1-Heptenyl ethyl ether

Reaction thermochemistry data

Data compiled by: Hussein Y. Afeefy, Joel F. Liebman, and Stephen E. Stein

Individual Reactions

cis-1-Heptenyl ethyl ether = Ether, ethyl 1-heptenyl, (E)-

By formula: C9H18O = C9H18O

Quantity Value Units Method Reference Comment
Δr-3.85 ± 0.24kJ/molEqkOkuyama, Fueno, et al., 1969liquid phase; GC

References

Okuyama, Fueno, et al., 1969
Okuyama, T.; Fueno, T.; Furukawa, J., Structure and reactivity of α,β-unsaturated ethers. 9. Cis-trans isomerization equilibriums in the liquid phase, Tetrahedron, 1969, 25, 5409-5414. [all data]