N-Aminopyrrolidine

Gas phase ion energetics data

Data compiled by: Sharon G. Lias, Rhoda D. Levin, and Sherif A. Kafafi

Ionization energy determinations

IE (eV) Method Reference Comment
8.681PENelsen and Buschek, 1974Vertical value

References

Nelsen and Buschek, 1974
Nelsen, S.F.; Buschek, J.M., Photoelectron spectra of hydrazines. IV. Empirical estimation of lone pair-lone pair dihedral angles and prediction of lone pair ionization potentials for some cyclic and bicyclic hydrazines, J. Am. Chem. Soc., 1974, 96, 6982. [all data]