N-Nitrosonornicotine

Normal alkane RI, non-polar column, temperature ramp

View large format table.

Column type Active phase I Reference Comment
CapillaryDB-51756.Andersen, Fleming, et al., 1989He, 60. C @ 1. min, 4. K/min, 260. C @ 5. min; Column length: 30. m; Column diameter: 0.25 mm

References

Andersen, Fleming, et al., 1989
Andersen, R.A.; Fleming, P.D.; Burton, H.R.; Hamilton-Kemp, T.R.; Sutton, T.G., N'-Acyl and N'-nitroso pyridine alkaloids in alkaloid lines of burley tobacco during growth and air-curing, J. Agric. Food Chem., 1989, 37, 1, 44-50, https://doi.org/10.1021/jf00085a011 . [all data]