3-Hexanethiol

Kovats' RI, polar column, isothermal

View large format table.

Column type Active phase Temperature (C) I Reference Comment
CapillaryPEG-20M93.1062.5Morishita, Murakita, et al., 1985Column length: 50. m; Column diameter: 0.25 mm
CapillaryPEG-20M80.1058.Morishita, Murakita, et al., 1982N2; Column length: 50. m; Column diameter: 0.25 mm

Normal alkane RI, non-polar column, isothermal

View large format table.

Column type Active phase Temperature (C) I Reference Comment
CapillaryDC-20050.850.Leppin, Gollnick, et al., 1969Argon; Column length: 100. m

Normal alkane RI, non-polar column, custom temperature program

View large format table.

Column type Active phase I Reference Comment
CapillaryTR-5 MS862.Kurashov, Mitrukova, et al., 201415. m/0.25 mm/0.25 μm, Helium; Program: 35 0C (3 min) 2 0C/min -> 60 0C (3 min) 2 0C/min -> 80 0C (3 min) 4 0C/min -> 120 0C (3 min) 5 0C/min -> 150 0C (3 min) 15 0C/min -> 240 0C (10 min)

References

Morishita, Murakita, et al., 1985
Morishita, F.; Murakita, H.; Kojima, T., Prediction of retention indices of thiols and sulfides under different conditions of capillary gas chromatography, Bunseki Kagaku, 1985, 34, 12, 800-802, https://doi.org/10.2116/bunsekikagaku.34.12_800 . [all data]

Morishita, Murakita, et al., 1982
Morishita, F.; Murakita, H.; Takemura, Y.; Kojima, T., Prediction of molecular structures of thiols and sulphides by retention indices, J. Chromatogr., 1982, 239, 483-492, https://doi.org/10.1016/S0021-9673(00)82005-1 . [all data]

Leppin, Gollnick, et al., 1969
Leppin, E.; Gollnick, K.; Schomburg, G., Gas chromatographic identification of isomeric mercaptans, Chromatographia, 1969, 2, 12, 535-540, https://doi.org/10.1007/BF02260096 . [all data]

Kurashov, Mitrukova, et al., 2014
Kurashov, E.A.; Mitrukova, G.G.; Krylova, Yu.V., Variations in the component composition of essential oil of Ceratophyllum demersum (Ceratophyllaceae) during vegetation (in press), Plant Resources (Rastitel'nye Resursy), 2014, 1, 000-000. [all data]