Silane, chloromethylphenyl-

Kovats' RI, non-polar column, isothermal

View large format table.

Column type Active phase Temperature (C) I Reference Comment
PackedPolymethylsiloxane, (PMS-20000)50.1028.4Ainshtein and Shulyatieva, 1972He, Chromosorb W; Column length: 2. m

Phase change data

Data compiled by: Robert L. Brown and Stephen E. Stein

Reduced pressure boiling point

Tboil (K) Pressure (bar) Reference
386.0.133PCR Inc., 1990

References

Ainshtein and Shulyatieva, 1972
Ainshtein, A.A.; Shulyatieva, T.I., Retention indices of alkyl- and arylchlorosilanes, Zh. Anal. Khim., 1972, 27, 816-821. [all data]