di-n-Undecylamine

Phase change data

Data compiled by: Thermodynamics Research Center, NIST Boulder Laboratories, Chris Muzny director

Quantity Value Units Method Reference Comment
Tfus325.15KN/AWright and Elderfield, 1946Uncertainty assigned by TRC = 1. K

In addition to the Thermodynamics Research Center (TRC) data available from this site, much more physical and chemical property data is available from the following TRC products:

References

Wright and Elderfield, 1946
Wright, J.B.; Elderfield, R.C., Alkylamino Carbinols Derived from 9-Acyl-1,2,3,4- Tetrahydrophenanthrene Derivatives, J. Org. Chem., 1946, 11, 111. [all data]