Hydrazine, 1,2-dipropyl-

Gas phase ion energetics data

Data compiled by: Sharon G. Lias, Rhoda D. Levin, and Sherif A. Kafafi

Ionization energy determinations

IE (eV) Method Reference Comment
8.62PERademacher, 1975Vertical value

References

Rademacher, 1975
Rademacher, P., Acyclische Hydrazine, Chem. Ber., 1975, 108, 1548. [all data]