Thiophene, 2-butyltetrahydro-

Kovats' RI, non-polar column, isothermal

View large format table.

Column type Active phase Temperature (C) I Reference Comment
CapillaryApiezon L120.1169.Agr, Tesaric, et al., 1973
CapillarySqualane120.1098.Agr, Tesaric, et al., 1973
CapillarySqualane86.1093.Agr, Tesaric, et al., 1973
CapillarySqualane120.1098.Agrawal, Tesarík, et al., 1972N2, Celite 545; Column length: 50. m; Column diameter: 0.3 mm
CapillarySqualane86.1093.Agrawal, Tesarík, et al., 1972N2, Celite 545; Column length: 50. m; Column diameter: 0.3 mm
CapillaryApiezon L120.1169.Agrawal, Tesarík, et al., 1972N2; Column length: 100. m; Column diameter: 0.3 mm
PackedApiezon L110.1168.Martinu and Janák, 1970
PackedApiezon L130.1174.Martinu and Janák, 1970
PackedApiezon L150.1182.Martinu and Janák, 1970

Normal alkane RI, non-polar column, temperature ramp

View large format table.

Column type Active phase I Reference Comment
CapillaryCP-Sil 51133.Damste, van Dalen, et al., 198825. m/0.32 mm/0.45 μm, Helium, 0. C @ 5. min, 3. K/min; Tend: 300. C
CapillaryCP-Sil 51133.Damste, van Dalen, et al., 198825. m/0.32 mm/0.45 μm, Helium, 0. C @ 5. min, 3. K/min; Tend: 300. C
CapillaryCP Sil 5 CB1133.Damste, Kock-van Dalen, et al., 198825. m/0.32 mm/0.45 μm, He, 3. K/min; Tstart: 50. C; Tend: 300. C
CapillaryCP Sil 5 CB1133.Damste, Kock-van Dalen, et al., 198825. m/0.32 mm/0.45 μm, He, 3. K/min; Tstart: 50. C; Tend: 300. C

Normal alkane RI, non-polar column, custom temperature program

View large format table.

Column type Active phase I Reference Comment
CapillaryMethyl Silicone1131.Farkas, Héberger, et al., 2004Program: not specified

References

Agr, Tesaric, et al., 1973
Agr, X.X.; Tesaric, K.; Janak, J., Will be entered later, J. Chromatogr., 1973, 95, 207-215. [all data]

Agrawal, Tesarík, et al., 1972
Agrawal, B.B.; Tesarík, K.; Janák, J., Gas chromatographic characterization of sulphur compounds in the 93-162° gasoline cut from Romashkino crude oil using Kováts retention indices, J. Chromatogr., 1972, 65, 1, 207-215, https://doi.org/10.1016/S0021-9673(00)86933-2 . [all data]

Martinu and Janák, 1970
Martinu, V.; Janák, J., Gas-liquid chromatographic retention data of some aliphatic and alicyclic sulphides, J. Chromatogr., 1970, 52, 69-75, https://doi.org/10.1016/S0021-9673(01)96545-8 . [all data]

Damste, van Dalen, et al., 1988
Damste, J.S.S.; van Dalen, A.C.K.; de Leeuw, J.W.; Schenck, P.A., Identification of homologous series of alkylated thiophenes, thiolanes, thianes and benzothiophenes present in pyrolisates of sulfur-rich kerogenes, J. Chromatogr., 1988, 435, 435-452, https://doi.org/10.1016/S0021-9673(01)82208-1 . [all data]

Damste, Kock-van Dalen, et al., 1988
Damste, J.S.S.; Kock-van Dalen, A.C.; de Leeuw, J.W.; Schenk, P.A., Identification of homologous series of alkylated thiophenes, thiolanes, thianes and benzothiophenes present in pyrolysates of sulphur-rich kerogens, J. Chromatogr., 1988, 435, 435-452, https://doi.org/10.1016/S0021-9673(01)82208-1 . [all data]

Farkas, Héberger, et al., 2004
Farkas, O.; Héberger, K.; Zenkevich, I.G., Quantitative structure-retention relationships. XIV. Prediction of gas chromatographic retention indices for saturated O-, N-, and S-heterocyclic compounds, Chemom. Intell. Lab. Syst., 2004, 72, 2, 173-184, https://doi.org/10.1016/j.chemolab.2004.01.012 . [all data]