1-Aminopyrene

Gas phase ion energetics data

Data compiled by: Henry M. Rosenstock, Keith Draxl, Bruce W. Steiner, and John T. Herron

Ionization energy determinations

IE (eV) Method Reference
6.8 ± 0.1CTSFarrell and Newton, 1966

Phase change data

Data compiled by: Thermodynamics Research Center, NIST Boulder Laboratories, Chris Muzny director

Quantity Value Units Method Reference Comment
Tfus455.KN/AVollman, Becker, et al., 1937Uncertainty assigned by TRC = 3. K

In addition to the Thermodynamics Research Center (TRC) data available from this site, much more physical and chemical property data is available from the following TRC products:

References

Farrell and Newton, 1966
Farrell, P.G.; Newton, J., Ionization potentials of primary aromatic amines and aza-hydrocarbons, Tetrahedron Lett., 1966, 5517. [all data]