Hexanal dimethyl acetal

Kovats' RI, non-polar column, isothermal

View large format table.

Column type Active phase Temperature (C) I Reference Comment
CapillarySqualane115.929.Lafosse and Thuaud-Chourrout, 1975Column length: 100. m; Column diameter: 0.25 mm

Normal alkane RI, non-polar column, temperature ramp

View large format table.

Column type Active phase I Reference Comment
CapillaryHP-5MS980.Hadaruga, Hadaruga, et al., 200630. m/0.25 mm/0.25 μm, He, 4. K/min; Tstart: 50. C; Tend: 250. C

Normal alkane RI, non-polar column, custom temperature program

View large format table.

Column type Active phase I Reference Comment
CapillarySE-30964.Vinogradov, 2004Program: not specified

Normal alkane RI, polar column, custom temperature program

View large format table.

Column type Active phase I Reference Comment
CapillaryCarbowax 20M1156.Vinogradov, 2004Program: not specified

References

Lafosse and Thuaud-Chourrout, 1975
Lafosse, M.; Thuaud-Chourrout, N., Etude du comportement de composés halogénés et mèthoxylés en CG dans le cas de quatre phases stationnaires liquides pouvant former des liaisons de type donneur-accepteur d'électrons avec les groupes fonctionnels de ces composés, Chromatographia, 1975, 8, 4, 195-202, https://doi.org/10.1007/BF02274456 . [all data]

Hadaruga, Hadaruga, et al., 2006
Hadaruga, N.G.; Hadaruga, D.I.; Paunescu, V.; Tatu, C.; Ordodi, V.L.; Bandur, G.; Lupea, A.X., Thermal stability of the linoleic acid/α- and β-cyclodextrin complexes, Food Chem., 2006, 99, 3, 500-508, https://doi.org/10.1016/j.foodchem.2005.08.012 . [all data]

Vinogradov, 2004
Vinogradov, B.A., Production, composition, properties and application of essential oils, 2004, retrieved from http://viness.narod.ru. [all data]