1-Naphthalenecarboxaldehyde, 4-methoxy-

Normal alkane RI, non-polar column, temperature ramp

View large format table.

Column type Active phase I Reference Comment
CapillaryDB-5 MS1831.Ulrich, Schuurmann, et al., 201330. m/0.25 mm/0.25 μm, Helium, 50. C @ 4. min, 6. K/min, 300. C @ 20. min

References

Ulrich, Schuurmann, et al., 2013
Ulrich, N.; Schuurmann, G.; Brack, W., Prediction of gas chromatographic retention indices as classifier in non-target analysis of environmental samples, J. Chromatogr. A, 2013, 1285, 139-147, https://doi.org/10.1016/j.chroma.2013.02.037 . [all data]