9,12-Octadecadien-1-ol

Phase change data

Data compiled by: Thermodynamics Research Center, NIST Boulder Laboratories, Chris Muzny director

Quantity Value Units Method Reference Comment
Tfus270.KN/ATurpeinen, 1938Uncertainty assigned by TRC = 5. K

In addition to the Thermodynamics Research Center (TRC) data available from this site, much more physical and chemical property data is available from the following TRC products:

References

Turpeinen, 1938
Turpeinen, O., Linoleyl Alcohol: Preparation and Some Properties, J. Am. Chem. Soc., 1938, 60, 56. [all data]