lead(2+) decanoate

Phase change data

Data compiled by: Eugene S. Domalski and Elizabeth D. Hearing

Enthalpy of fusion

ΔfusH (kJ/mol) Temperature (K) Reference Comment
32.700354.9Adeosun and Sime, 1976Crystal-smectic.

Entropy of fusion

ΔfusS (J/mol*K) Temperature (K) Reference Comment
92.0354.9Adeosun and Sime, 1976Crystal-smectic.

Enthalpy of phase transition

ΔHtrs (kJ/mol) Temperature (K) Initial Phase Final Phase Reference Comment
20.000367.4liquidliquidAdeosun and Sime, 1976
1.000385.2liquidliquidAdeosun and Sime, 1976

Entropy of phase transition

ΔStrs (J/mol*K) Temperature (K) Initial Phase Final Phase Reference Comment
54.4367.4liquid, Smecticliquid, isomorphousAdeosun and Sime, 1976
2.7385.2liquid, Isomorphousliquid, liquidAdeosun and Sime, 1976

References

Adeosun and Sime, 1976
Adeosun, S.O.; Sime, S.J., Properties of molten carboxylates. Part 4: A quantitative differential thermal analysis study of melting and mesophase formation in some lead(II) carboxylates, Thermochim. Acta, 1976, 17, 351-359. [all data]