3-Methylenecyclobutanenitrile

Gas phase thermochemistry data

Data compiled by: Hussein Y. Afeefy, Joel F. Liebman, and Stephen E. Stein

Quantity Value Units Method Reference Comment
Δfgas252.4kJ/molCcrHall and Baldt, 1971

References

Hall and Baldt, 1971
Hall, H.K., Jr.; Baldt, J.H., Thermochemistry of strained-ring bridgehead nitriles and esters, J. Am. Chem. Soc., 1971, 93, 140-145. [all data]