Nickel, bis(1,1,1-trifluoro-4-thioxo-2-pentanonato-O,S)-

Gas phase ion energetics data

Data compiled by: Sharon G. Lias, Rhoda D. Levin, and Sherif A. Kafafi

Ionization energy determinations

IE (eV) Method Reference Comment
7.80PECauletti and Furlani, 1975Vertical value

References

Cauletti and Furlani, 1975
Cauletti, C.; Furlani, C., He(I) photoelectron spectra of bis(β-diketonate)nickel(II) complexes their and mono- and di-thio analogues, J. Electron Spectrosc. Relat. Phenom., 1975, 6, 465. [all data]