Bis(isopropyl)beryllium

Gas phase ion energetics data

Data compiled by: Henry M. Rosenstock, Keith Draxl, Bruce W. Steiner, and John T. Herron

Ionization energy determinations

IE (eV) Method Reference
8.80 ± 0.02EIChambers, Coates, et al., 1969

Appearance energy determinations

Ion AE (eV) Other Products MethodReferenceComment
C3H6Be+9.60 ± 0.01C3H8EIChambers, Coates, et al., 1969
C3H7Be+10.65 ± 0.01C3H7EIChambers, Coates, et al., 1969

References

Chambers, Coates, et al., 1969
Chambers, D.B.; Coates, G.E.; Glockling, F., Electron impact studies on organo-beryllium and -aluminium compounds, Faraday Discuss. Chem. Soc., 1969, 47, 157. [all data]