Tridecane, 2-methyl-

Phase change data

Data compiled as indicated in comments:
TRC - Thermodynamics Research Center, NIST Boulder Laboratories, Chris Muzny director
AC - William E. Acree, Jr., James S. Chickos

Quantity Value Units Method Reference Comment
Tfus247.3KN/APetrov, Sergienko, et al., 1959Uncertainty assigned by TRC = 2. K; TRC
Tfus251.KN/APetrov and Melekhin, 1955Uncertainty assigned by TRC = 4. K; TRC

Enthalpy of vaporization

ΔvapH (kJ/mol) Temperature (K) Method Reference Comment
56.3403.AStephenson and Malanowski, 1987Based on data from 388. - 530. K.; AC

In addition to the Thermodynamics Research Center (TRC) data available from this site, much more physical and chemical property data is available from the following TRC products:

References

Petrov, Sergienko, et al., 1959
Petrov, A.A.; Sergienko, S.R.; Nechitailo, N.A.; Tsedilina, A.L., Izv. Akad. Nauk SSSR, 1959, 1959, 1091-7. [all data]

Petrov and Melekhin, 1955
Petrov, A.D.; Melekhin, V.M., Synthesis of Branched Aliphatic Hydrocarbons of Comsition C11 - C16 from β-Alkenyl Halides, Zh. Obshch. Khim., 1955, 25, 1327-34. [all data]

Stephenson and Malanowski, 1987
Stephenson, Richard M.; Malanowski, Stanislaw, Handbook of the Thermodynamics of Organic Compounds, 1987, https://doi.org/10.1007/978-94-009-3173-2 . [all data]