Eicosane, 2-methyl-

Phase change data

Data compiled by: William E. Acree, Jr., James S. Chickos

Enthalpy of vaporization

ΔvapH (kJ/mol) Temperature (K) Method Reference Comment
70.3488.AStephenson and Malanowski, 1987Based on data from 473. - 621. K.

Kovats' RI, non-polar column, isothermal

View large format table.

Column type Active phase Temperature (C) I Reference Comment
CapillaryOV-101180.2064.Kusmierz, Malinski, et al., 1985Column length: 22. m; Column diameter: 0.3 mm
CapillaryApiezon L180.2060.5Kusmierz, Malinski, et al., 1985He; Column length: 20. m; Column diameter: 0.3 mm
CapillarySE-52180.2063.1Kusmierz, Malinski, et al., 1985He; Column length: 40. m; Column diameter: 0.3 mm

Kovats' RI, polar column, isothermal

View large format table.

Column type Active phase Temperature (C) I Reference Comment
CapillaryCarbowax 20M150.2061.7Kusmierz, Malinski, et al., 1985He; Column length: 30. m; Column diameter: 0.25 mm

Van Den Dool and Kratz RI, non-polar column, temperature ramp

View large format table.

Column type Active phase I Reference Comment
CapillaryHP-5MS2063.Zhao, Liang, et al., 200530. m/0.25 mm/0.25 μm, He, 2. K/min; Tstart: 80. C; Tend: 290. C
CapillaryHP-5MS2062.8Zhao, Liang, et al., 200530. m/0.25 mm/0.25 μm, He, 4. K/min; Tstart: 80. C; Tend: 290. C
CapillaryHP-5MS2062.8Zhao, Liang, et al., 200530. m/0.25 mm/0.25 μm, He, 6. K/min; Tstart: 80. C; Tend: 290. C
CapillaryCross-Linked Methylsilicone2064.Khorasheh, Gray, et al., 19895. K/min; Tstart: 40. C; Tend: 300. C

Van Den Dool and Kratz RI, non-polar column, custom temperature program

View large format table.

Column type Active phase I Reference Comment
CapillaryDB-52064.Zaikin and Borisov, 2002He; Column length: 30. m; Column diameter: 0.25 mm; Program: 30C => 5K/min=120C => 10C/min => 270C

Normal alkane RI, non-polar column, temperature ramp

View large format table.

Column type Active phase I Reference Comment
CapillaryOV-12065.3Krkosova, Kubinec, et al., 2007100. m/0.32 mm/0.25 μm, Helium, 5. K/min, 310. C @ 5. min; Tstart: 30. C

Normal alkane RI, non-polar column, custom temperature program

View large format table.

Column type Active phase I Reference Comment
CapillarySqualane2064.Petrov, 1984Program: not specified

References

Stephenson and Malanowski, 1987
Stephenson, Richard M.; Malanowski, Stanislaw, Handbook of the Thermodynamics of Organic Compounds, 1987, https://doi.org/10.1007/978-94-009-3173-2 . [all data]