Isocyanocyclobexanemolybdenum pentacarbonyl

Gas phase ion energetics data

Data compiled by: Henry M. Rosenstock, Keith Draxl, Bruce W. Steiner, and John T. Herron

Ionization energy determinations

IE (eV) Method Reference
7.72EIPignataro, Foffani, et al., 1968

References

Pignataro, Foffani, et al., 1968
Pignataro, S.; Foffani, A.; Innorta, G.; Distefano, G., Mass spectra and ionization potentials of group VI-B substituted transition-metal carbonyls, Advan. Mass Spectrom., 1968, 4, 323. [all data]