Diethyl 1,1-cyclopropanedicarboxylate

Phase change data

Data compiled as indicated in comments:
BS - Robert L. Brown and Stephen E. Stein
AC - William E. Acree, Jr., James S. Chickos

Reduced pressure boiling point

Tboil (K) Pressure (bar) Reference Comment
368.20.013Aldrich Chemical Company Inc., 1990BS

Enthalpy of vaporization

ΔvapH (kJ/mol) Temperature (K) Method Reference Comment
63.9 ± 0.5288. - 318.GSVerevkin, Kümmerlin, et al., 1998AC

References

Aldrich Chemical Company Inc., 1990
Aldrich Chemical Company Inc., Catalog Handbook of Fine Chemicals, Aldrich Chemical Company, Inc., Milwaukee WI, 1990, 1. [all data]

Verevkin, Kümmerlin, et al., 1998
Verevkin, S.P.; Kümmerlin, M.; Beckhaus, H.-D.; Galli, C.; Rüchardt, C., Geminal substituent effects, 16 - Do alkoxycarbonyl substituents stabilize small cycloalkane rings?, Eur. J. Org. Chem., 1998, 4, 579. [all data]