Pentanoic acid, cyclohexyl ester

Phase change data

Data compiled as indicated in comments:
TRC - Thermodynamics Research Center, NIST Boulder Laboratories, Chris Muzny director
AC - William E. Acree, Jr., James S. Chickos

Quantity Value Units Method Reference Comment
Ttriple222.40KN/AKabo, Kozyro, et al., 1999Uncertainty assigned by TRC = 0.15 K; TRC
Quantity Value Units Method Reference Comment
Δvap63.7 ± 0.1kJ/molCPaulechka, Zaitsau, et al., 2004See also Zaitsau, Verevkin, et al., 2003.; AC
Δvap67.2 ± 0.8kJ/molMEZaitsau, Verevkin, et al., 2003Based on data from 273. - 318. K.; AC
Δvap63.9 ± 0.4kJ/molMEZaitsau, Verevkin, et al., 2003Based on data from 273. - 318. K.; AC
Δvap62.4 ± 0.7kJ/molGSZaitsau, Verevkin, et al., 2003Based on data from 293. - 332. K.; AC

In addition to the Thermodynamics Research Center (TRC) data available from this site, much more physical and chemical property data is available from the following TRC products:

Normal alkane RI, non-polar column, temperature ramp

View large format table.

Column type Active phase I Reference Comment
CapillaryUltra-11299.Okumura, 199125. m/0.32 mm/0.25 μm, He, 3. K/min; Tstart: 80. C; Tend: 260. C

Normal alkane RI, non-polar column, custom temperature program

View large format table.

Column type Active phase I Reference Comment
CapillarySE-301310.Vinogradov, 2004Program: not specified

Normal alkane RI, polar column, custom temperature program

View large format table.

Column type Active phase I Reference Comment
CapillaryCarbowax 20M1595.Vinogradov, 2004Program: not specified

References

Kabo, Kozyro, et al., 1999
Kabo, G.J. (see Kabo; Kozyro, A.A.; Frenkel, M. (see frenke ml); Blokhin, A.V., Solid Phase Transitions of the Cyclohexane Derivatives and the Model of Energy States of Molecules in Plastic Crystals, Mol. Cryst. Liq. Cryst., 1999, 326, 333-5. [all data]

Paulechka, Zaitsau, et al., 2004
Paulechka, Y.U.; Zaitsau, Dz.H.; Kabo, G.J., On the difference between isobaric and isochoric heat capacities of liquid cyclohexyl esters, Journal of Molecular Liquids, 2004, 115, 2-3, 105-111, https://doi.org/10.1016/j.molliq.2004.03.002 . [all data]

Zaitsau, Verevkin, et al., 2003
Zaitsau, Dzmitry H.; Verevkin, Sergey P.; Paulechka, Yauheni U.; Kabo, Gennady J.; Sevruk, Viktor M., Comprehensive Study of Vapor Pressures and Enthalpies of Vaporization of Cyclohexyl Esters, J. Chem. Eng. Data, 2003, 48, 6, 1393-1400, https://doi.org/10.1021/je025634v . [all data]