2,4-Pentanedione, 3-(1-methylethyl)-

Gas phase thermochemistry data

Data compiled by: Hussein Y. Afeefy, Joel F. Liebman, and Stephen E. Stein

Quantity Value Units Method Reference Comment
Δfgas-448.9kJ/molIonConrath, Van de Sande, et al., 1974Mass spectrometery (enol)

References

Conrath, Van de Sande, et al., 1974
Conrath, k.; Van de Sande, C.; Vandewalle, M., Studies in organic mass spectrometry. XVI. A combined approach to the structures of ions generated from the molecular ions of acyclic β-diketones through loss of small neutral molecules, Org. Mass Spectrom., 1974, 9, 585-593. [all data]